Target
Histone deacetylase
Ligand
BDBM50366749
Substrate
Meas. Tech.
ChEBML_79057
IC50
2±n/a nM
Citation
 Colletti, SLMyers, RWDarkin-Rattray, SJGurnett, AMDulski, PMGaluska, SAllocco, JJAyer, MBLi, CLim, JCrumley, TMCannova, CSchmatz, DMWyvratt, MJFisher, MHMeinke, PT Broad spectrum antiprotozoal agents that inhibit histone deacetylase: structure-activity relationships of apicidin. Part 2. Bioorg Med Chem Lett 11:113-7 (2001)  
Target
Name:
Histone deacetylase
Synonyms:
Type:
PROTEIN
Mol. Mass.:
50433.01
Organism:
Cryptosporidium parvum
Description:
ChEMBL_79057
Residue:
444
  
Inhibitor
Name:
BDBM50366749
Synonyms:
CHEMBL1793983
Type:
Small organic molecule
Emp. Form.:
C33H44ClN5O5
Mol. Mass.:
626.186
SMILES:
CC[C@H](C)[C@@H]1NC(=O)[C@H](NC(=O)[C@H](CCCCCC(=O)CC)NC(=O)[C@H]2CCCCN2C1=O)c1cnc2ccccc2c1Cl
: