Target
Histone deacetylase
Ligand
BDBM50366727
Substrate
Meas. Tech.
ChEBML_79059
Ki
100±n/a nM
Citation
 Colletti, SLMyers, RWDarkin-Rattray, SJGurnett, AMDulski, PMGaluska, SAllocco, JJAyer, MBLi, CLim, JCrumley, TMCannova, CSchmatz, DMWyvratt, MJFisher, MHMeinke, PT Broad spectrum antiprotozoal agents that inhibit histone deacetylase: structure-activity relationships of apicidin. Part 2. Bioorg Med Chem Lett 11:113-7 (2001)  
Target
Name:
Histone deacetylase
Synonyms:
Type:
PROTEIN
Mol. Mass.:
48692.87
Organism:
Cryptosporidium parvum
Description:
ChEMBL_87390
Residue:
432
  
Inhibitor
Name:
BDBM50366727
Synonyms:
CHEMBL1793981
Type:
Small organic molecule
Emp. Form.:
C30H50N4O6
Mol. Mass.:
562.7412
SMILES:
CC[C@H](C)[C@@H]1NC(=O)[C@H](CC(=O)C(C)(C)C)NC(=O)[C@H](CCCCCC(=O)CC)NC(=O)[C@H]2CCCCN2C1=O
: