Target
Metabotropic glutamate receptor 3
Ligand
BDBM50062522
Substrate
Meas. Tech.
ChEBML_219008
IC50
16±n/a nM
Citation
 Pellicciari, RCostantino, GMarinozzi, MMacchiarulo, AAmori, LJosef Flor, PGasparini, FKuhn, RUrwyler, S Design, synthesis and preliminary evaluation of novel 3'-substituted carboxycyclopropylglycines as antagonists at group 2 metabotropic glutamate receptors. Bioorg Med Chem Lett 11:3179-82 (2001)  
Target
Name:
Metabotropic glutamate receptor 3
Synonyms:
GRM3_RAT Grm3 glutamate receptor, metabotropic 3 precursor
Type:
Protein
Mol. Mass.:
98971.84
Organism:
Rattus norvegicus (Rat)
Description:
P31422
Residue:
879
  
Inhibitor
Name:
BDBM50062522
Synonyms:
(1S,2S)-2-((S)-1-amino-1-carboxy-2-(9H-xanthen-9-yl)ethyl)cyclopropanecarboxylic acid (1S,2S)-2-[(S)-1-Amino-1-carboxy-2-(9H-xanthen-9-yl)-ethyl]-cyclopropanecarboxylic acid (S)-2-[(S)-1-Amino-1-carboxy-2-(9H-xanthen-9-yl)-ethyl]-cyclopropanecarboxylic acid 2-[1-Amino-1-carboxy-2-(9H-xanthen-9-yl)-ethyl]-cyclopropanecarboxylic acid(LY341495) | CHEMBL432038
Type:
Small organic molecule
Emp. Form.:
C20H19NO5
Mol. Mass.:
353.3686
SMILES:
N[C@@](CC1c2ccccc2Oc2ccccc12)([C@H]1C[C@@H]1C(O)=O)C(O)=O
: