Target
Neuronal acetylcholine receptor subunit alpha-3
Ligand
BDBM50000483
Substrate
Meas. Tech.
ChEMBL_143235 (CHEMBL752378)
Ki
67000±n/a nM
Citation
 Macor, JEGurley, DLanthorn, TLoch, JMack, RAMullen, GTran, OWright, NGordon, JC The 5-HT3 antagonist tropisetron (ICS 205-930) is a potent and selective alpha7 nicotinic receptor partial agonist. Bioorg Med Chem Lett 11:319-21 (2001)  
Target
Name:
Neuronal acetylcholine receptor subunit alpha-3
Synonyms:
ACHA3_HUMAN Cholinergic, Nicotinic Alpha3Beta2 Cholinergic, Nicotinic Alpha3Beta4x NACHRA3 Neuronal acetylcholine receptor subunit alpha-3 nicotinic central
Type:
Enzyme Catalytic Domain
Mol. Mass.:
57479.03
Organism:
Homo sapiens (Human)
Description:
Cholinergic, Nicotinic Alpha3Beta2 0 HUMAN::P32297
Residue:
505
  
Inhibitor
Name:
BDBM50000483
Synonyms:
(BRL 43694)1-Methyl-1H-indazole-3-carboxylic acid (9-methyl-9-aza-bicyclo[3.3.1]non-3-yl)-amide 1-Methyl-1H-indazole-3-carboxylic acid (8-methyl-8-aza-bicyclo[3.2.1]oct-3-yl)-amide 1-Methyl-1H-indazole-3-carboxylic acid (9-methyl-9-aza-bicyclo[3.3.1]non-3-yl)-amide(BRL 43694) 1-methyl-N-((1S,5R)-9-methyl-9-aza-bicyclo[3.3.1]nonan-3-yl)-1H-indazole-3-carboxamide BRL 43694 CHEMBL519643 LY-278584
Type:
Small organic molecule
Emp. Form.:
C18H24N4O
Mol. Mass.:
312.4094
SMILES:
CN1C2CCCC1CC(C2)NC(=O)c1nn(C)c2ccccc12
: