Target
Neuronal acetylcholine receptor subunit alpha-7
Ligand
BDBM50096711
Substrate
Meas. Tech.
ChEBML_144033
Ki
8.80±n/a nM
Citation
 Macor, JEGurley, DLanthorn, TLoch, JMack, RAMullen, GTran, OWright, NGordon, JC The 5-HT3 antagonist tropisetron (ICS 205-930) is a potent and selective alpha7 nicotinic receptor partial agonist. Bioorg Med Chem Lett 11:319-21 (2001)  
Target
Name:
Neuronal acetylcholine receptor subunit alpha-7
Synonyms:
ACHA7_MOUSE Chrna7 Neuronal nicotinic acetylcholine receptor
Type:
PROTEIN
Mol. Mass.:
56632.61
Organism:
Mus musculus
Description:
ChEMBL_144033
Residue:
502
  
Inhibitor
Name:
BDBM50096711
Synonyms:
CHEMBL320963 | Indole-1-carboxylic acid 1-aza-bicyclo[2.2.2]oct-3-yl ester
Type:
Small organic molecule
Emp. Form.:
C16H18N2O2
Mol. Mass.:
270.3263
SMILES:
O=C(OC1CN2CCC1CC2)n1ccc2ccccc12
: