Target
Neuronal acetylcholine receptor subunit alpha-7
Ligand
BDBM50096712
Substrate
Meas. Tech.
ChEBML_217791
EC50
280±n/a nM
Citation
 Macor, JEGurley, DLanthorn, TLoch, JMack, RAMullen, GTran, OWright, NGordon, JC The 5-HT3 antagonist tropisetron (ICS 205-930) is a potent and selective alpha7 nicotinic receptor partial agonist. Bioorg Med Chem Lett 11:319-21 (2001)  
Target
Name:
Neuronal acetylcholine receptor subunit alpha-7
Synonyms:
ACHA7_HUMAN Cholinergic, Nicotinic Alpha7 Neuronal acetylcholine receptor protein alpha-7 subunit Nicotinic acetylcholine receptor alpha-7 (alpha7 nAChR)
Type:
Mol. Mass.:
56448.33
Organism:
Homo sapiens (Human)
Description:
CHRNA7 (NACHRA7)
Residue:
502
  
Inhibitor
Name:
BDBM50096712
Synonyms:
3-(1H-Indole-3-carbonyloxy)-8,8-dimethyl-8-azonia-bicyclo[3.2.1]octane | CHEMBL111583
Type:
Small organic molecule
Emp. Form.:
C18H23N2O2
Mol. Mass.:
299.3869
SMILES:
C[N+]1(C)C2CCC1CC(C2)OC(=O)c1c[nH]c2ccccc12
: