Target
Neuronal acetylcholine receptor subunit alpha-7
Ligand
BDBM82070
Substrate
Meas. Tech.
ChEMBL_217792 (CHEMBL882443)
EC50
38000±n/a nM
Citation
 Macor, JEGurley, DLanthorn, TLoch, JMack, RAMullen, GTran, OWright, NGordon, JC The 5-HT3 antagonist tropisetron (ICS 205-930) is a potent and selective alpha7 nicotinic receptor partial agonist. Bioorg Med Chem Lett 11:319-21 (2001)  
Target
Name:
Neuronal acetylcholine receptor subunit alpha-7
Synonyms:
ACHA7_HUMAN Cholinergic, Nicotinic Alpha7 Neuronal acetylcholine receptor protein alpha-7 subunit Nicotinic acetylcholine receptor alpha-7 (alpha7 nAChR)
Type:
Mol. Mass.:
56448.33
Organism:
Homo sapiens (Human)
Description:
CHRNA7 (NACHRA7)
Residue:
502
  
Inhibitor
Name:
BDBM82070
Synonyms:
CAS_29790-52-1 Nicotine-D salicylate US9303017, Nicotine
Type:
Emp. Form.:
C10H14N2
Mol. Mass.:
162.2316
SMILES:
CN1CCC[C@H]1c1cccnc1
: