Target
Neuronal acetylcholine receptor subunit alpha-7
Ligand
BDBM50096713
Substrate
Meas. Tech.
ChEBML_217791
EC50
580±n/a nM
Citation
 Macor, JEGurley, DLanthorn, TLoch, JMack, RAMullen, GTran, OWright, NGordon, JC The 5-HT3 antagonist tropisetron (ICS 205-930) is a potent and selective alpha7 nicotinic receptor partial agonist. Bioorg Med Chem Lett 11:319-21 (2001)  
Target
Name:
Neuronal acetylcholine receptor subunit alpha-7
Synonyms:
ACHA7_HUMAN Cholinergic, Nicotinic Alpha7 Neuronal acetylcholine receptor protein alpha-7 subunit Nicotinic acetylcholine receptor alpha-7 (alpha7 nAChR)
Type:
Mol. Mass.:
56448.33
Organism:
Homo sapiens (Human)
Description:
CHRNA7 (NACHRA7)
Residue:
502
  
Inhibitor
Name:
BDBM50096713
Synonyms:
1H-Indole-3-carboxylic acid 1-aza-bicyclo[2.2.2]oct-3-yl ester | CHEMBL108799
Type:
Small organic molecule
Emp. Form.:
C16H18N2O2
Mol. Mass.:
270.3263
SMILES:
O=C(OC1CN2CCC1CC2)c1c[nH]c2ccccc12
: