Target
Gastrin/cholecystokinin type B receptor
Ligand
BDBM50097723
Substrate
Meas. Tech.
ChEBML_48265
IC50
11000±n/a nM
Citation
 Dziadulewicz, EKWalpole, CSSnell, CRWrigglesworth, RHughes, GABeattie, DWood, JNBeech, MMCoote, PR Design of non-peptide CCK2 and NK1 peptidomimetics using 1-(2-nitrophenyl)thiosemicarbazide as a novel common scaffold. Bioorg Med Chem Lett 11:705-9 (2001)  
Target
Name:
Gastrin/cholecystokinin type B receptor
Synonyms:
Cckbr Cholecystokinin receptor Gastrin/cholecystokinin type B receptor
Type:
Enzyme Catalytic Domain
Mol. Mass.:
49196.59
Organism:
MOUSE
Description:
Cholecystokinin A CCKBR MOUSE::P56481
Residue:
453
  
Inhibitor
Name:
BDBM50097723
Synonyms:
1-(2-nitrophenyl)thiosemicarbazide analogue | CHEMBL159469
Type:
Small organic molecule
Emp. Form.:
C21H24N6O6S2
Mol. Mass.:
520.582
SMILES:
OC(=O)CCCNS(=O)(=O)c1ccc(N[N-]C(=[SH+])NCCc2c[nH]c3ccccc23)c(c1)[N+]([O-])=O
: