Target
Stromelysin-1
Ligand
BDBM50098915
Substrate
Meas. Tech.
ChEBML_104725
IC50
1.3±n/a nM
Citation
 Pikul, SDunham, KMAlmstead, NGDe, BNatchus, MGTaiwo, YOWilliams, LEHynd, BAHsieh, LCJanusz, MJGu, FMieling, GE Heterocycle-based MMP inhibitors with P2' substituents. Bioorg Med Chem Lett 11:1009-13 (2001)  
Target
Name:
Stromelysin-1
Synonyms:
MMP-3 MMP3_HUMAN Matrix metalloproteinase 3 Matrix metalloproteinase-3 (MMP-3) SL-1 Stromelysin 1 | Transin-1
Type:
Enzyme
Mol. Mass.:
53973.13
Organism:
Homo sapiens (Human)
Description:
P08254
Residue:
477
  
Inhibitor
Name:
BDBM50098915
Synonyms:
(R)-1-tert-Butyl-3-(4-methoxy-benzenesulfonyl)-6-oxo-hexahydro-pyrimidine-4-carboxylic acid hydroxyamide | CHEMBL7108
Type:
Small organic molecule
Emp. Form.:
C16H23N3O6S
Mol. Mass.:
385.435
SMILES:
COc1ccc(cc1)S(=O)(=O)N1CN(C(=O)C[C@@H]1C(=O)NO)C(C)(C)C
: