Target
Prothrombin
Ligand
BDBM50107440
Substrate
Meas. Tech.
ChEBML_87153
IC50
1400±n/a nM
Citation
 Das, JKimball, SDReid, JAWang, TCLau, WFRoberts, DGSeiler, SMSchumacher, WAOgletree, ML Thrombin active site inhibitors: chemical synthesis, in vitro and in vivo pharmacological profile of a novel and selective agent BMS-189090 and analogues. Bioorg Med Chem Lett 12:41-4 (2001)  
Target
Name:
Prothrombin
Synonyms:
Activation peptide fragment 1 Coagulation factor II Prothrombin precursor Thrombin heavy chain | Thrombin light chain
Type:
Protein
Mol. Mass.:
70029.57
Organism:
Homo sapiens (Human)
Description:
P00734
Residue:
622
  
Inhibitor
Name:
BDBM50107440
Synonyms:
CHEMBL136076 | Naphthalene-2-sulfonic acid {(S)-2-[(S)-2-(4-guanidino-butylsulfanylmethyl)-pyrrolidin-1-yl]-1-hydroxymethyl-2-oxo-ethyl}-amide
Type:
Small organic molecule
Emp. Form.:
C23H33N5O4S2
Mol. Mass.:
507.669
SMILES:
NC(=N)NCCCCSC[C@@H]1CCCN1C(=O)[C@H](CO)NS(=O)(=O)c1ccc2ccccc2c1
: