Target
Tyrosine-protein kinase Lck
Ligand
BDBM50112965
Substrate
Meas. Tech.
ChEBML_221513
IC50
8500±n/a nM
Citation
 Hobbs, CJBit, RACansfield, ADHarris, BHill, CHHilyard, KLKilford, IRKitas, EKroehn, ALovell, PPole, DRugman, PSherborne, BSSmith, IEVesey, DRWalmsley, DLWhittaker, DWilliams, GWilson, FBanner, DSurgenor, ABorkakoti, N Structure-based design of peptidomimetic antagonists of p56(lck) SH2 domain. Bioorg Med Chem Lett 12:1365-9 (2002)  
Target
Name:
Tyrosine-protein kinase Lck
Synonyms:
2.7.10.2 LCK_HUMAN Leukocyte C-terminal Src kinase Lymphocyte-specific protein tyrosine kinase Protein YT16 Proto-oncogene tyrosine-protein kinase LCK T cell-specific protein-tyrosine kinase
Type:
Mol. Mass.:
57987.83
Organism:
Homo sapiens (Human)
Description:
P06239
Residue:
509
  
Inhibitor
Name:
BDBM50112965
Synonyms:
CHEMBL441774 | Phosphoric acid mono-{4-[(S)-2-acetylamino-2-((4S,7S)-4-ethylcarbamoyl-6,10-dioxo-octahydro-pyridazino[1,2-a][1,2]diazepin-7-ylcarbamoyl)-ethyl]-phenyl} ester
Type:
Small organic molecule
Emp. Form.:
C23H32N5O9P
Mol. Mass.:
553.502
SMILES:
CCNC(=O)[C@@H]1CCCN2N1C(=O)[C@H](CCC2=O)NC(=O)[C@H](Cc1ccc(OP(O)(O)=O)cc1)NC(C)=O
: