Target
Tyrosine-protein kinase Lck
Ligand
BDBM50112975
Substrate
Meas. Tech.
ChEBML_221513
IC50
1200±n/a nM
Citation
 Hobbs, CJBit, RACansfield, ADHarris, BHill, CHHilyard, KLKilford, IRKitas, EKroehn, ALovell, PPole, DRugman, PSherborne, BSSmith, IEVesey, DRWalmsley, DLWhittaker, DWilliams, GWilson, FBanner, DSurgenor, ABorkakoti, N Structure-based design of peptidomimetic antagonists of p56(lck) SH2 domain. Bioorg Med Chem Lett 12:1365-9 (2002)  
Target
Name:
Tyrosine-protein kinase Lck
Synonyms:
2.7.10.2 LCK_HUMAN Leukocyte C-terminal Src kinase Lymphocyte-specific protein tyrosine kinase Protein YT16 Proto-oncogene tyrosine-protein kinase LCK T cell-specific protein-tyrosine kinase
Type:
Mol. Mass.:
57987.83
Organism:
Homo sapiens (Human)
Description:
P06239
Residue:
509
  
Inhibitor
Name:
BDBM50112975
Synonyms:
CHEMBL282111 | Phosphoric acid mono-(4-{(S)-2-acetylamino-2-[(4S,7S)-4-(indan-1-ylcarbamoyl)-6,10-dioxo-octahydro-pyridazino[1,2-a][1,2]diazepin-7-ylcarbamoyl]-ethyl}-phenyl) ester
Type:
Small organic molecule
Emp. Form.:
C30H36N5O9P
Mol. Mass.:
641.6087
SMILES:
CC(=O)N[C@@H](Cc1ccc(OP(O)(O)=O)cc1)C(=O)N[C@H]1CCC(=O)N2CCC[C@H](N2C1=O)C(=O)NC1CCc2ccccc12
: