Target
Carbonic anhydrase 4
Ligand
BDBM50114180
Substrate
Meas. Tech.
ChEBML_45264
Ki
2.10±n/a nM
Citation
 Scozzafava, ASupuran, CT Carbonic anhydrase inhibitors. Preparation of potent sulfonamides inhibitors incorporating bile acid tails. Bioorg Med Chem Lett 12:1551-7 (2002)  
Target
Name:
Carbonic anhydrase 4
Synonyms:
CA-IV CAH4_BOVIN Carbonic Anhydrase IV Carbonic anhydrase 4
Type:
Enzyme
Mol. Mass.:
35152.74
Organism:
Bos taurus (bovine)
Description:
Bovine isozyme, isolated from lung microsomes
Residue:
312
  
Inhibitor
Name:
BDBM50114180
Synonyms:
(1R,2R,5R)-4-((1R,5S,8S,10R,11S,12S)-3,12-Dihydroxy-10,13-dimethyl-hexadecahydro-cyclopenta[a]phenanthren-17-yl)-pentanoic acid [2-(5-sulfamoyl-[1,3,4]thiadiazol-2-ylcarbamoyl)-ethyl]-amide | CHEMBL3137789
Type:
Small organic molecule
Emp. Form.:
C29H47N5O6S2
Mol. Mass.:
625.843
SMILES:
[H][C@@]1(CC[C@@]2([H])[C@]3([H])CC[C@]4([H])C[C@H](O)CC[C@]4(C)[C@@]3([H])C[C@H](O)[C@]12C)[C@H](C)CCC(=O)NCCC(=O)Nc1nnc(s1)S(N)(=O)=O
: