Target
Carbonic anhydrase 4
Ligand
BDBM50114130
Substrate
Meas. Tech.
ChEBML_45264
Ki
2.00±n/a nM
Citation
 Scozzafava, ASupuran, CT Carbonic anhydrase inhibitors. Preparation of potent sulfonamides inhibitors incorporating bile acid tails. Bioorg Med Chem Lett 12:1551-7 (2002)  
Target
Name:
Carbonic anhydrase 4
Synonyms:
CA-IV CAH4_BOVIN Carbonic Anhydrase IV Carbonic anhydrase 4
Type:
Enzyme
Mol. Mass.:
35152.74
Organism:
Bos taurus (bovine)
Description:
Bovine isozyme, isolated from lung microsomes
Residue:
312
  
Inhibitor
Name:
BDBM50114130
Synonyms:
(1R,2R)-4-((8S,9S,12R,14R,17S)-3-(R)-Hydroxy-10,13-dimethyl-hexadecahydro-cyclopenta[a]phenanthren-17-yl)-pentanoic acid 2-sulfamoyl-benzothiazol-6-yl ester | CHEMBL3138171
Type:
Small organic molecule
Emp. Form.:
C31H44N2O5S2
Mol. Mass.:
588.821
SMILES:
[H][C@@]1(CC[C@@]2([H])[C@]3([H])CC[C@]4([H])C[C@H](O)CC[C@]4(C)[C@@]3([H])CC[C@]12C)[C@H](C)CCC(=O)Oc1ccc2nc(sc2c1)S(N)(=O)=O
: