Target
Carbonic anhydrase 4
Ligand
BDBM50114193
Substrate
Meas. Tech.
ChEBML_45264
Ki
2.00±n/a nM
Citation
 Scozzafava, ASupuran, CT Carbonic anhydrase inhibitors. Preparation of potent sulfonamides inhibitors incorporating bile acid tails. Bioorg Med Chem Lett 12:1551-7 (2002)  
Target
Name:
Carbonic anhydrase 4
Synonyms:
CA-IV CAH4_BOVIN Carbonic Anhydrase IV Carbonic anhydrase 4
Type:
Enzyme
Mol. Mass.:
35152.74
Organism:
Bos taurus (bovine)
Description:
Bovine isozyme, isolated from lung microsomes
Residue:
312
  
Inhibitor
Name:
BDBM50114193
Synonyms:
(R)-4-((7S,8S,9S,10R,12R,14S,17R)-3,7-Dihydroxy-10-(R)-methyl-13-methyl-hexadecahydro-cyclopenta[a]phenanthren-17-yl)-pentanoic acid [3-methyl-5-sulfamoyl-3H-[1,3,4]thiadiazol-(2Z)-ylidene]-amide | CHEMBL2113375
Type:
Small organic molecule
Emp. Form.:
C27H44N4O5S2
Mol. Mass.:
568.792
SMILES:
[H][C@@]1(CC[C@@]2([H])[C@]3([H])[C@@H](O)C[C@]4([H])C[C@H](O)CC[C@]4(C)[C@@]3([H])CC[C@]12C)[C@H](C)CCC(=O)\N=c1/sc(nn1C)S(N)(=O)=O
: