Target
Carbonic anhydrase 4
Ligand
BDBM50114213
Substrate
Meas. Tech.
ChEBML_45264
Ki
2.10±n/a nM
Citation
 Scozzafava, ASupuran, CT Carbonic anhydrase inhibitors. Preparation of potent sulfonamides inhibitors incorporating bile acid tails. Bioorg Med Chem Lett 12:1551-7 (2002)  
Target
Name:
Carbonic anhydrase 4
Synonyms:
CA-IV CAH4_BOVIN Carbonic Anhydrase IV Carbonic anhydrase 4
Type:
Enzyme
Mol. Mass.:
35152.74
Organism:
Bos taurus (bovine)
Description:
Bovine isozyme, isolated from lung microsomes
Residue:
312
  
Inhibitor
Name:
BDBM50114213
Synonyms:
(1R,5R)-4-((5S,8S,9R,11R,17S)-3-Hydroxy-10-methyl-13-(R)-methyl-hexadecahydro-cyclopenta[a]phenanthren-17-yl)-pentanoic acid [2-(5-sulfamoyl-[1,3,4]thiadiazol-2-ylcarbamoyl)-ethyl]-amide | CHEMBL3137777
Type:
Small organic molecule
Emp. Form.:
C29H47N5O5S2
Mol. Mass.:
609.844
SMILES:
[H][C@@]1(CC[C@@]2([H])[C@]3([H])CC[C@]4([H])C[C@H](O)CC[C@]4(C)[C@@]3([H])CC[C@]12C)[C@H](C)CCC(=O)NCCC(=O)Nc1nnc(s1)S(N)(=O)=O
: