Target
Acetylcholinesterase
Ligand
BDBM50117606
Substrate
Meas. Tech.
ChEMBL_28291 (CHEMBL644831)
IC50
110±n/a nM
Citation
 Palin, RClark, JKCowley, PMuir, AWPow, EProsser, ABTaylor, RZhang, MQ Novel piperidinium and pyridinium agents as water-soluble acetylcholinesterase inhibitors for the reversal of neuromuscular blockade. Bioorg Med Chem Lett 12:2569-72 (2002)  
Target
Name:
Acetylcholinesterase
Synonyms:
ACES_HUMAN Acetylcholinesterase (AChE) | Acetylcholinesterase (human AChE)
Type:
Enzyme
Mol. Mass.:
67792.70
Organism:
Homo sapiens (Human)
Description:
P22303
Residue:
614
  
Inhibitor
Name:
BDBM50117606
Synonyms:
1-Benzyl-4-[5-(5,6-dimethoxy-benzo[b]thiophen-2-yl)-5-oxo-pentyl]-1-methyl-piperidinium; bromide | CHEMBL88049
Type:
Small organic molecule
Emp. Form.:
C28H36NO3S
Mol. Mass.:
466.655
SMILES:
COc1cc2cc(sc2cc1OC)C(=O)CCCCC1CC[N+](C)(Cc2ccccc2)CC1
: