Target
Dipeptidyl peptidase 2
Ligand
BDBM50118954
Substrate
Meas. Tech.
ChEBML_53193
IC50
>500000±n/a nM
Citation
 Senten, KVan der Veken, PBal, GDe Meester, ILambeir, AMScharpé, SBauvois, BHaemers, AAugustyns, K Development of potent and selective dipeptidyl peptidase II inhibitors. Bioorg Med Chem Lett 12:2825-8 (2002)  
Target
Name:
Dipeptidyl peptidase 2
Synonyms:
DAP II DPP2_HUMAN Dipeptidyl aminopeptidase II Dipeptidyl peptidase 2 (DPP2) Dipeptidyl peptidase II (DPP II) Dipeptidyl peptidase II and dipeptidyl peptidase IV (DPP2 and DPP4) carboxytripeptidase dipeptidyl(amino)peptidase II | dipeptidylarylamidase
Type:
Protein
Mol. Mass.:
54339.29
Organism:
Homo sapiens (Human)
Description:
Q9UHL4
Residue:
492
  
Inhibitor
Name:
BDBM50118954
Synonyms:
CHEMBL328655 | Pyrrolidin-2-yl-pyrrolidin-1-yl-methanethione
Type:
Small organic molecule
Emp. Form.:
C9H16N2S
Mol. Mass.:
184.302
SMILES:
S=C(C1CCCN1)N1CCCC1
: