Target
Nociceptin receptor
Ligand
BDBM50120147
Substrate
Meas. Tech.
ChEMBL_145014 (CHEMBL756276)
Ki
31.0±n/a nM
Citation
 Wu, WLCaplen, MADomalski, MSZhang, HFawzi, ABurnett, DA Synthesis and structure-activity relationships of aminoalkylazetidines as ORL1 receptor ligands. Bioorg Med Chem Lett 12:3157-60 (2002)  
Target
Name:
Nociceptin receptor
Synonyms:
KOR-3 Mu-type opioid receptor (Mu) Nociceptin Receptor (ORL1 Receptor) Nociceptin receptor (ORL-1) Nociceptin/Orphanin FQ, NOP receptor OPIATE ORL-1 OPRL1 protein ORL1 Opioid receptor like-1 Orphanin FQ receptor (ORL1) | P41146
Type:
G Protein-Coupled Receptor (GPCR)
Mol. Mass.:
40702.87
Organism:
Homo sapiens (Human)
Description:
P41146
Residue:
370
  
Inhibitor
Name:
BDBM50120147
Synonyms:
C-[(S)-C-((S)-1-Benzhydryl-azetidin-2-yl)-C-(3-trifluoromethyl-phenyl)]-methylamine | CHEMBL316961
Type:
Small organic molecule
Emp. Form.:
C24H23F3N2
Mol. Mass.:
396.448
SMILES:
N[C@H]([C@@H]1CCN1C(c1ccccc1)c1ccccc1)c1cccc(c1)C(F)(F)F
: