Target
Nociceptin receptor
Ligand
BDBM50120151
Substrate
Meas. Tech.
ChEBML_145007
Ki
30±n/a nM
Citation
 Wu, WLCaplen, MADomalski, MSZhang, HFawzi, ABurnett, DA Synthesis and structure-activity relationships of aminoalkylazetidines as ORL1 receptor ligands. Bioorg Med Chem Lett 12:3157-60 (2002)  
Target
Name:
Nociceptin receptor
Synonyms:
KOR-3 Mu-type opioid receptor (Mu) Nociceptin Receptor (ORL1 Receptor) Nociceptin receptor (ORL-1) Nociceptin/Orphanin FQ, NOP receptor OPIATE ORL-1 OPRL1 protein ORL1 Opioid receptor like-1 Orphanin FQ receptor (ORL1) | P41146
Type:
G Protein-Coupled Receptor (GPCR)
Mol. Mass.:
40702.87
Organism:
Homo sapiens (Human)
Description:
P41146
Residue:
370
  
Inhibitor
Name:
BDBM50120151
Synonyms:
C-{(R)-C-(3-Chloro-phenyl)-C-[(S)-1-(1-phenyl-pentyl)-azetidin-2-yl]}-methylamine | CHEMBL108893
Type:
Small organic molecule
Emp. Form.:
C21H27ClN2
Mol. Mass.:
342.905
SMILES:
CCCCC(N1CC[C@H]1[C@H](N)c1cccc(Cl)c1)c1ccccc1
: