Target
Melanocyte-stimulating hormone receptor
Ligand
BDBM50131251
Substrate
Meas. Tech.
ChEMBL_79557 (CHEMBL691187)
EC50
0.009000±n/a nM
Citation
 Koikov, LNEbetino, FHSolinsky, MGCross-Doersen, DKnittel, JJ Sub-nanomolar hMC1R agonists by end-capping of the melanocortin tetrapeptide His-D-Phe-Arg-Trp-NH(2). Bioorg Med Chem Lett 13:2647-50 (2003)  
Target
Name:
Melanocyte-stimulating hormone receptor
Synonyms:
MC1-R MSH-R MSHR_HUMAN Melanocortin receptor (M1 and M4) Melanocortin receptor 1 (MC1-R) | Melanocortin receptor 1 (MC1R)
Type:
Enzyme
Mol. Mass.:
34717.23
Organism:
Homo sapiens (Human)
Description:
Q01726
Residue:
317
  
Inhibitor
Name:
BDBM50131251
Synonyms:
(S)-5-Guanidino-2-{(S)-2-[(S)-3-(3H-imidazol-4-yl)-2-(4-phenyl-butyrylamino)-propionylamino]-3-phenyl-propionylamino}-pentanoic acid [(S)-1-carbamoyl-2-(1H-indol-3-yl)-ethyl]-amide | CHEMBL431801
Type:
Small organic molecule
Emp. Form.:
C42H51N11O5
Mol. Mass.:
789.925
SMILES:
NC(=N)NCCC[C@H](NC(=O)[C@H](Cc1ccccc1)NC(=O)[C@H](Cc1cnc[nH]1)NC(=O)CCCc1ccccc1)C(=O)N[C@@H](Cc1c[nH]c2ccccc12)C(N)=O
: