Target
Prothrombin
Ligand
BDBM50131460
Substrate
Meas. Tech.
ChEBML_208517
Ki
0.050000±n/a nM
Citation
 Nantermet, PGBarrow, JCNewton, CLPellicore, JMYoung, MLewis, SDLucas, BJKrueger, JAMcMasters, DRYan, YKuo, LCVacca, JPSelnick, HG Design and synthesis of potent and selective macrocyclic thrombin inhibitors. Bioorg Med Chem Lett 13:2781-4 (2003)  
Target
Name:
Prothrombin
Synonyms:
Activation peptide fragment 1 Coagulation factor II Prothrombin precursor Thrombin heavy chain | Thrombin light chain
Type:
Protein
Mol. Mass.:
70029.57
Organism:
Homo sapiens (Human)
Description:
P00734
Residue:
622
  
Inhibitor
Name:
BDBM50131460
Synonyms:
(S)-20-Benzyl-8,25-dichloro-12-oxa-1,4,18,21,23-pentaaza-tricyclo[20.3.1.0*6,11*]hexacosa-6(11),7,9,22,24-pentaene-3,26-dione | CHEMBL418965
Type:
Small organic molecule
Emp. Form.:
C27H31Cl2N5O3
Mol. Mass.:
544.473
SMILES:
Clc1ccc2OCCCCCNC[C@H](Cc3ccccc3)Nc3ncc(Cl)n(CC(=O)NCc2c1)c3=O
: