Target
Thymidylate kinase
Ligand
BDBM50132307
Substrate
Meas. Tech.
ChEBML_208218
Ki
90000±n/a nM
Citation
 Vanheusden, VVan Rompaey, PMunier-Lehmann, HPochet, SHerdewijn, PVan Calenbergh, S Thymidine and thymidine-5'-O-monophosphate analogues as inhibitors of Mycobacterium tuberculosis thymidylate kinase. Bioorg Med Chem Lett 13:3045-8 (2003)  
Target
Name:
Thymidylate kinase
Synonyms:
KTHY_MYCTU Thymidine monophosphate kinase tmk
Type:
PROTEIN
Mol. Mass.:
22636.29
Organism:
Mycobacterium tuberculosis
Description:
ChEMBL_208218
Residue:
214
  
Inhibitor
Name:
BDBM50132307
Synonyms:
CHEMBL322925 | N-[(2R,5R)-3-Hydroxy-5-(5-methyl-2,4-dioxo-3,4-dihydro-2H-pyrimidin-1-yl)-tetrahydro-furan-2-ylmethyl]-acetamide
Type:
Small organic molecule
Emp. Form.:
C12H17N3O5
Mol. Mass.:
283.2805
SMILES:
CC(=O)NC[C@H]1O[C@H](C[C@@H]1O)n1cc(C)c(=O)[nH]c1=O
: