Target
Peroxisome proliferator-activated receptor alpha
Ligand
BDBM50132571
Substrate
Meas. Tech.
ChEBML_153546
Ki
38±n/a nM
Citation
 Adams, ADHu, Zvon Langen, DDadiz, AElbrecht, AMacNaul, KLBerger, JPZhou, GDoebber, TWMeurer, RForrest, MJMoller, DEJones, AB O-arylmandelic acids as highly selective human PPAR alpha/gamma agonists. Bioorg Med Chem Lett 13:3185-90 (2003)  
Target
Name:
Peroxisome proliferator-activated receptor alpha
Synonyms:
NR1C1 PPAR PPAR-alpha PPARA_HUMAN Peroxisome proliferator-activated receptor | Peroxisome proliferator-activated receptor alpha (PPAR alpha)
Type:
Enzyme
Mol. Mass.:
52222.08
Organism:
Homo sapiens (Human)
Description:
Q07869
Residue:
468
  
Inhibitor
Name:
BDBM50132571
Synonyms:
(5-Chloro-3-ethyl-7-propyl-benzo[d]isoxazol-6-yloxy)-phenyl-acetic acid | CHEMBL319637
Type:
Small organic molecule
Emp. Form.:
C20H20ClNO4
Mol. Mass.:
373.83
SMILES:
CCCc1c(OC(C(O)=O)c2ccccc2)c(Cl)cc2c(CC)noc12
: