Target
Peroxisome proliferator-activated receptor alpha
Ligand
BDBM50132568
Substrate
Meas. Tech.
ChEMBL_153543 (CHEMBL766084)
Ki
37.0±n/a nM
Citation
 Adams, ADHu, Zvon Langen, DDadiz, AElbrecht, AMacNaul, KLBerger, JPZhou, GDoebber, TWMeurer, RForrest, MJMoller, DEJones, AB O-arylmandelic acids as highly selective human PPAR alpha/gamma agonists. Bioorg Med Chem Lett 13:3185-90 (2003)  
Target
Name:
Peroxisome proliferator-activated receptor alpha
Synonyms:
NR1C1 PPAR PPAR-alpha PPARA_HUMAN Peroxisome proliferator-activated receptor | Peroxisome proliferator-activated receptor alpha (PPAR alpha)
Type:
Enzyme
Mol. Mass.:
52222.08
Organism:
Homo sapiens (Human)
Description:
Q07869
Residue:
468
  
Inhibitor
Name:
BDBM50132568
Synonyms:
(3-Hydroxy-4-propionyl-2,6-dipropyl-phenoxy)-phenyl-acetic acid | CHEMBL110353
Type:
Small organic molecule
Emp. Form.:
C23H28O5
Mol. Mass.:
384.4654
SMILES:
CCCc1cc(C(=O)CC)c(O)c(CCC)c1OC(C(O)=O)c1ccccc1
: