Target
Peroxisome proliferator-activated receptor alpha
Ligand
BDBM50132567
Substrate
Meas. Tech.
ChEBML_153546
Ki
37±n/a nM
Citation
 Adams, ADHu, Zvon Langen, DDadiz, AElbrecht, AMacNaul, KLBerger, JPZhou, GDoebber, TWMeurer, RForrest, MJMoller, DEJones, AB O-arylmandelic acids as highly selective human PPAR alpha/gamma agonists. Bioorg Med Chem Lett 13:3185-90 (2003)  
Target
Name:
Peroxisome proliferator-activated receptor alpha
Synonyms:
NR1C1 PPAR PPAR-alpha PPARA_HUMAN Peroxisome proliferator-activated receptor | Peroxisome proliferator-activated receptor alpha (PPAR alpha)
Type:
Enzyme
Mol. Mass.:
52222.08
Organism:
Homo sapiens (Human)
Description:
Q07869
Residue:
468
  
Inhibitor
Name:
BDBM50132567
Synonyms:
(5,7-Dipropyl-3-trifluoromethyl-benzo[d]isoxazol-6-yloxy)-phenyl-acetic acid | CHEMBL323773
Type:
Small organic molecule
Emp. Form.:
C22H22F3NO4
Mol. Mass.:
421.4096
SMILES:
CCCc1cc2c(noc2c(CCC)c1OC(C(O)=O)c1ccccc1)C(F)(F)F
: