Target
Peroxisome proliferator-activated receptor gamma
Ligand
BDBM50132576
Substrate
Meas. Tech.
ChEMBL_154356 (CHEMBL759117)
Ki
5940±n/a nM
Citation
 Adams, ADHu, Zvon Langen, DDadiz, AElbrecht, AMacNaul, KLBerger, JPZhou, GDoebber, TWMeurer, RForrest, MJMoller, DEJones, AB O-arylmandelic acids as highly selective human PPAR alpha/gamma agonists. Bioorg Med Chem Lett 13:3185-90 (2003)  
Target
Name:
Peroxisome proliferator-activated receptor gamma
Synonyms:
NR1C3 PPAR-gamma PPARG_HUMAN Peroxisome proliferator-activated receptor gamma (PPAR gamma) Peroxisome proliferator-activated receptor gamma (PPARĪ³) peroxisome proliferator-activated receptor gamma isoform 2
Type:
Nuclear Receptor
Mol. Mass.:
57613.46
Organism:
Homo sapiens (Human)
Description:
P37231
Residue:
505
  
Inhibitor
Name:
BDBM50132576
Synonyms:
4-(Carboxy-phenyl-methoxy)-3-methyl-5-propyl-benzoic acid methyl ester | CHEMBL430505
Type:
Small organic molecule
Emp. Form.:
C20H22O5
Mol. Mass.:
342.3857
SMILES:
CCCc1cc(cc(C)c1OC(C(O)=O)c1ccccc1)C(=O)OC
: