Target
Peroxisome proliferator-activated receptor alpha
Ligand
BDBM50132572
Substrate
Meas. Tech.
ChEBML_153546
Ki
63±n/a nM
Citation
 Adams, ADHu, Zvon Langen, DDadiz, AElbrecht, AMacNaul, KLBerger, JPZhou, GDoebber, TWMeurer, RForrest, MJMoller, DEJones, AB O-arylmandelic acids as highly selective human PPAR alpha/gamma agonists. Bioorg Med Chem Lett 13:3185-90 (2003)  
Target
Name:
Peroxisome proliferator-activated receptor alpha
Synonyms:
NR1C1 PPAR PPAR-alpha PPARA_HUMAN Peroxisome proliferator-activated receptor | Peroxisome proliferator-activated receptor alpha (PPAR alpha)
Type:
Enzyme
Mol. Mass.:
52222.08
Organism:
Homo sapiens (Human)
Description:
Q07869
Residue:
468
  
Inhibitor
Name:
BDBM50132572
Synonyms:
4-(Carboxy-phenyl-methoxy)-3,5-dipropyl-benzoic acid methyl ester | CHEMBL110725
Type:
Small organic molecule
Emp. Form.:
C22H26O5
Mol. Mass.:
370.4388
SMILES:
CCCc1cc(cc(CCC)c1OC(C(O)=O)c1ccccc1)C(=O)OC
: