Target
Sphingosine 1-phosphate receptor 2
Ligand
BDBM50133418
Substrate
Meas. Tech.
ChEMBL_201318 (CHEMBL806168)
EC50
2685±n/a nM
Citation
 Clemens, JJDavis, MDLynch, KRMacdonald, TL Synthesis of para-alkyl aryl amide analogues of sphingosine-1-phosphate: discovery of potent S1P receptor agonists. Bioorg Med Chem Lett 13:3401-4 (2003)  
Target
Name:
Sphingosine 1-phosphate receptor 2
Synonyms:
EDG5 S1PR2 Sphingosine 1-phosphate receptor Sphingosine-1-phosphate receptor 2 | ndothelial differentiation G-protein coupled receptor 5
Type:
G Protein-Coupled Receptor (GPCR)
Mol. Mass.:
38883.16
Organism:
Homo sapiens (Human)
Description:
Membranes isolated from S1P2-transfected CHO cells were used in ligand binding assay.
Residue:
353
  
Inhibitor
Name:
BDBM50133418
Synonyms:
CHEMBL423691 | Phosphoric acid mono-((S)-2-amino-2-tetradecylcarbamoyl-ethyl) ester; TFA
Type:
Small organic molecule
Emp. Form.:
C17H37N2O5P
Mol. Mass.:
380.4598
SMILES:
CCCCCCCCCCCCCCNC(=O)[C@@H](N)COP(O)(O)=O
: