Target
Sphingosine 1-phosphate receptor 1
Ligand
BDBM50133418
Substrate
Meas. Tech.
ChEMBL_201311 (CHEMBL805799)
EC50
397±n/a nM
Citation
 Clemens, JJDavis, MDLynch, KRMacdonald, TL Synthesis of para-alkyl aryl amide analogues of sphingosine-1-phosphate: discovery of potent S1P receptor agonists. Bioorg Med Chem Lett 13:3401-4 (2003)  
Target
Name:
Sphingosine 1-phosphate receptor 1
Synonyms:
CHEDG1 Endothelial differentiation G-protein coupled receptor 1 S1P1 S1PR1_HUMAN Sphingosine 1-phosphate receptor Edg-1
Type:
Enzyme
Mol. Mass.:
42836.02
Organism:
Homo sapiens (Human)
Description:
P21453
Residue:
382
  
Inhibitor
Name:
BDBM50133418
Synonyms:
CHEMBL423691 | Phosphoric acid mono-((S)-2-amino-2-tetradecylcarbamoyl-ethyl) ester; TFA
Type:
Small organic molecule
Emp. Form.:
C17H37N2O5P
Mol. Mass.:
380.4598
SMILES:
CCCCCCCCCCCCCCNC(=O)[C@@H](N)COP(O)(O)=O
: