Target
Cytochrome P450 3A4
Ligand
BDBM50134247
Substrate
Meas. Tech.
ChEMBL_51920 (CHEMBL663568)
IC50
2500±n/a nM
Citation
 Chougnet, AStoessel, CWoggon, WD Design and synthesis of a new fluorescent probe for cytochrome P450 3A4 (CYP 3A4). Bioorg Med Chem Lett 13:3643-5 (2003)  
Target
Name:
Cytochrome P450 3A4
Synonyms:
Albendazole monooxygenase CP3A4_HUMAN CYP3A4 CYPIIIA4 Cytochrome P450 3A4 (CYP3A4) Nifedipine oxidase Taurochenodeoxycholate 6-alpha-hydroxylase
Type:
Enzyme
Mol. Mass.:
57349.57
Organism:
Homo sapiens (Human)
Description:
Residue:
503
  
Inhibitor
Name:
BDBM50134247
Synonyms:
4-(10-{4-[2-((6S,10R,17S)-17-Hydroxy-10-methyl-3-oxo-2,3,6,7,8,9,10,11,12,13,14,15,16,17-tetradecahydro-1H-cyclopenta[a]phenanthren-6-yl)-acetoxy]-butyl}-2,4-dioxo-4,10-dihydro-2H-pyrimido[4,5-b]quinolin-3-yl)-butyric acid ethyl ester | CHEMBL332643
Type:
Small organic molecule
Emp. Form.:
C41H51N3O8
Mol. Mass.:
713.8589
SMILES:
CCOC(=O)CCCn1c(=O)nc2n(CCCCOC(=O)C[C@@H]3CC4C5CC[C@H](O)C5CCC4[C@@]4(C)CCC(=O)C=C34)c3ccccc3cc2c1=O
: