Target
Cytochrome P450 3A4
Ligand
BDBM50134246
Substrate
Meas. Tech.
ChEMBL_51899 (CHEMBL666005)
IC50
10000±n/a nM
Citation
 Chougnet, AStoessel, CWoggon, WD Design and synthesis of a new fluorescent probe for cytochrome P450 3A4 (CYP 3A4). Bioorg Med Chem Lett 13:3643-5 (2003)  
Target
Name:
Cytochrome P450 3A4
Synonyms:
Albendazole monooxygenase CP3A4_HUMAN CYP3A4 CYPIIIA4 Cytochrome P450 3A4 (CYP3A4) Nifedipine oxidase Taurochenodeoxycholate 6-alpha-hydroxylase
Type:
Enzyme
Mol. Mass.:
57349.57
Organism:
Homo sapiens (Human)
Description:
Residue:
503
  
Inhibitor
Name:
BDBM50134246
Synonyms:
8-Chloro-6-(2-fluoro-phenyl)-4H-2,5,10b-triaza-benzo[e]azulen-4-ol | CHEMBL121550
Type:
Small organic molecule
Emp. Form.:
C17H11ClFN3O
Mol. Mass.:
327.74
SMILES:
OC1N=C(c2ccccc2F)c2cc(Cl)ccc2-n2cncc12
: