Target
C-C chemokine receptor type 5
Ligand
BDBM50124952
Substrate
Meas. Tech.
ChEBML_39654
Ki
14±n/a nM
Citation
 Palani, AShapiro, SClader, JWGreenlee, WJVice, SMcCombie, SCox, KStrizki, JBaroudy, BM Oximino-piperidino-piperidine-based CCR5 antagonists. Part 2: synthesis, SAR and biological evaluation of symmetrical heteroaryl carboxamides. Bioorg Med Chem Lett 13:709-12 (2003)  
Target
Name:
C-C chemokine receptor type 5
Synonyms:
C-C CKR-5 CC-CKR-5 CCR5 CCR5_HUMAN CHEMR13 HIV-1 fusion coreceptor
Type:
Enzyme
Mol. Mass.:
40540.21
Organism:
Homo sapiens (Human)
Description:
P51681
Residue:
352
  
Inhibitor
Name:
BDBM50124952
Synonyms:
(4-{(4-Bromo-phenyl)-[(E)-2,2,2-trifluoro-ethoxyimino]-methyl}-4'-methyl-[1,4']bipiperidinyl-1'-yl)-(4,6-dimethyl-pyrimidin-5-yl)-methanone | CHEMBL141201
Type:
Small organic molecule
Emp. Form.:
C27H33BrF3N5O2
Mol. Mass.:
596.482
SMILES:
Cc1ncnc(C)c1C(=O)N1CCC(C)(CC1)N1CCC(CC1)C(=N/OCC(F)(F)F)\c1ccc(Br)cc1
: