Target
Plasmepsin II
Ligand
BDBM50223627
Substrate
Meas. Tech.
ChEMBL_154915 (CHEMBL764690)
Ki
180±n/a nM
Citation
 Romeo, SDell'Agli, MParapini, SRizzi, LGalli, GMondani, MSparatore, ATaramelli, DBosisio, E Plasmepsin II inhibition and antiplasmodial activity of Primaquine-Statine 'double-drugs'. Bioorg Med Chem Lett 14:2931-4 (2004)  
Target
Name:
Plasmepsin II
Synonyms:
Aspartic hemoglobinase II PLM2_PLAFX Plasmepsin 2 Plasmepsin-II
Type:
Enzyme
Mol. Mass.:
51482.09
Organism:
Plasmodium falciparum
Description:
P46925
Residue:
453
  
Inhibitor
Name:
BDBM50223627
Synonyms:
CHEMBL3215350
Type:
Small organic molecule
Emp. Form.:
C30H45N3O5
Mol. Mass.:
527.6954
SMILES:
CCCCNC(=O)C[C@H](O)[C@H](CC(C)C)NC(=O)[C@@H](NC(=O)COc1ccc2ccccc2c1)[C@@H](C)CC
: