Target
Plasmepsin II
Ligand
BDBM50366909
Substrate
Meas. Tech.
ChEMBL_154914 (CHEMBL764689)
IC50
1.5±n/a nM
Citation
 Romeo, SDell'Agli, MParapini, SRizzi, LGalli, GMondani, MSparatore, ATaramelli, DBosisio, E Plasmepsin II inhibition and antiplasmodial activity of Primaquine-Statine 'double-drugs'. Bioorg Med Chem Lett 14:2931-4 (2004)  
Target
Name:
Plasmepsin II
Synonyms:
Aspartic hemoglobinase II PLM2_PLAFX Plasmepsin 2 Plasmepsin-II
Type:
Enzyme
Mol. Mass.:
51482.09
Organism:
Plasmodium falciparum
Description:
P46925
Residue:
453
  
Inhibitor
Name:
BDBM50366909
Synonyms:
CHEMBL1790773
Type:
Small organic molecule
Emp. Form.:
C57H85N9O8
Mol. Mass.:
1024.3403
SMILES:
CCCCNC(=O)C[C@H](O)[C@H](CC(C)C)NC(=O)[C@@H](NC(=O)c1ccc2cc(ccc2c1)C(=O)N[C@H](CC(C)C)C(=O)N[C@H](CCCCN)C(=O)NCCCC(C)Nc1cc(OC)cc2cccnc12)[C@H](C)CC
: