Target
Calpain-1 catalytic subunit
Ligand
BDBM50142283
Substrate
Meas. Tech.
ChEBML_43650
IC50
7±n/a nM
Citation
 Bihovsky, RTao, MMallamo, JPWells, GJ 1,2-Benzothiazine 1,1-dioxide alpha-ketoamide analogues as potent calpain I inhibitors. Bioorg Med Chem Lett 14:1035-8 (2004)  
Target
Name:
Calpain-1 catalytic subunit
Synonyms:
CAN1_HUMAN CAPN1 Calpain-1 (u-Calpain) Calpain1
Type:
Protein
Mol. Mass.:
81880.51
Organism:
Homo sapiens (Human)
Description:
Residue:
714
  
Inhibitor
Name:
BDBM50142283
Synonyms:
1,1-Dioxo-1,2,3,4-tetrahydro-1lambda*6*-benzo[e][1,2]thiazine-3-carboxylic acid [2-oxo-1-((S)-phenylmethyl)-ethyl]-amide | CHEMBL8605
Type:
Small organic molecule
Emp. Form.:
C18H18N2O4S
Mol. Mass.:
358.412
SMILES:
O=C[C@H](Cc1ccccc1)NC(=O)C1Cc2ccccc2S(=O)(=O)N1
: