Target
Mineralocorticoid receptor
Ligand
BDBM50144173
Substrate
Meas. Tech.
ChEBML_123675
IC50
162±n/a nM
Citation
 Akritopoulou-Zanze, IPatel, JRHartandi, KBrenneman, JWinn, MPratt, JKGrynfarb, MGoos-Nisson, AVon Geldern, TWKym, PR Synthesis and biological evaluation of novel, selective, nonsteroidal glucocorticoid receptor antagonists. Bioorg Med Chem Lett 14:2079-82 (2004)  
Target
Name:
Mineralocorticoid receptor
Synonyms:
MCR MLR NR3C2 | Nuclear receptor subfamily 3 group C member 2
Type:
Enzyme
Mol. Mass.:
107076.42
Organism:
Homo sapiens (Human)
Description:
P08235
Residue:
984
  
Inhibitor
Name:
BDBM50144173
Synonyms:
CHEMBL65221 | N-(1-Difluoromethoxy-6-phenyl-6H-benzo[c]chromen-8-yl)-methanesulfonamide
Type:
Small organic molecule
Emp. Form.:
C21H17F2NO4S
Mol. Mass.:
417.426
SMILES:
CS(=O)(=O)Nc1ccc-2c(c1)C(Oc1cccc(OC(F)F)c-21)c1ccccc1
: