Target
Progesterone receptor
Ligand
BDBM50144445
Substrate
Meas. Tech.
ChEMBL_29969 (CHEMBL875251)
IC50
>3000±n/a nM
Citation
 Collins, MAHudak, VBender, RFensome, AZhang, PMiller, LWinneker, RCZhang, ZZhu, YCohen, JUnwalla, RJWrobel, J Novel pyrrole-containing progesterone receptor modulators. Bioorg Med Chem Lett 14:2185-9 (2004)  
Target
Name:
Progesterone receptor
Synonyms:
NR3C3 PGR PRGR_HUMAN | progesterone
Type:
Protein
Mol. Mass.:
98979.52
Organism:
Homo sapiens (Human)
Description:
P06401
Residue:
933
  
Inhibitor
Name:
BDBM50144445
Synonyms:
2-(4,4-Dimethyl-2-oxo-1,4-dihydro-2H-benzo[d][1,3]oxazin-6-yl)-1H-pyrrole-3-carbonitrile | CHEMBL71984
Type:
Small organic molecule
Emp. Form.:
C15H13N3O2
Mol. Mass.:
267.2826
SMILES:
CC1(C)OC(=O)Nc2ccc(cc12)-c1[nH]ccc1C#N
: