Target
Carbonic anhydrase 9
Ligand
BDBM50144821
Substrate
Meas. Tech.
ChEBML_45444
Ki
11±n/a nM
Citation
 Vullo, DScozzafava, APastorekova, SPastorek, JSupuran, CT Carbonic anhydrase inhibitors: inhibition of the tumor-associated isozyme IX with fluorine-containing sulfonamides. The first subnanomolar CA IX inhibitor discovered. Bioorg Med Chem Lett 14:2351-6 (2004)  
Target
Name:
Carbonic anhydrase 9
Synonyms:
CA-IX CAH9_HUMAN Carbonic anhydrase 9 (CA IX) Carbonic anhydrase 9 precursor Carbonic anhydrase IX (CAIX) Carbonic anhydrases; II & IX MN RCC-associated antigen G250
Type:
Enzyme
Mol. Mass.:
49669.03
Organism:
Homo sapiens (Human)
Description:
Catalytic domain of human cloned isozyme was used in the assay
Residue:
459
  
Inhibitor
Name:
BDBM50144821
Synonyms:
2,3,5,6-Tetrafluoro-N-[3-methyl-5-sulfamoyl-3H-[1,3,4]thiadiazol-(2Z)-ylidene]-benzamide | CHEMBL76607
Type:
Small organic molecule
Emp. Form.:
C10H6F4N4O3S2
Mol. Mass.:
370.303
SMILES:
Cn1nc(s\c1=N/C(=O)c1c(F)c(F)cc(F)c1F)S(N)(=O)=O
: