Target
Carbonic anhydrase 9
Ligand
BDBM50144826
Substrate
Meas. Tech.
ChEBML_45444
Ki
8.5±n/a nM
Citation
 Vullo, DScozzafava, APastorekova, SPastorek, JSupuran, CT Carbonic anhydrase inhibitors: inhibition of the tumor-associated isozyme IX with fluorine-containing sulfonamides. The first subnanomolar CA IX inhibitor discovered. Bioorg Med Chem Lett 14:2351-6 (2004)  
Target
Name:
Carbonic anhydrase 9
Synonyms:
CA-IX CAH9_HUMAN Carbonic anhydrase 9 (CA IX) Carbonic anhydrase 9 precursor Carbonic anhydrase IX (CAIX) Carbonic anhydrases; II & IX MN RCC-associated antigen G250
Type:
Enzyme
Mol. Mass.:
49669.03
Organism:
Homo sapiens (Human)
Description:
Catalytic domain of human cloned isozyme was used in the assay
Residue:
459
  
Inhibitor
Name:
BDBM50144826
Synonyms:
2,3,5,6-Tetrafluoro-N-(4-sulfamoyl-benzyl)-benzenesulfonamide | CHEMBL265534
Type:
Small organic molecule
Emp. Form.:
C13H10F4N2O4S2
Mol. Mass.:
398.353
SMILES:
NS(=O)(=O)c1ccc(CNS(=O)(=O)c2c(F)c(F)cc(F)c2F)cc1
: