Target
Carbonic anhydrase 2
Ligand
BDBM50144825
Substrate
Meas. Tech.
ChEBML_45083
Ki
84±n/a nM
Citation
 Vullo, DScozzafava, APastorekova, SPastorek, JSupuran, CT Carbonic anhydrase inhibitors: inhibition of the tumor-associated isozyme IX with fluorine-containing sulfonamides. The first subnanomolar CA IX inhibitor discovered. Bioorg Med Chem Lett 14:2351-6 (2004)  
Target
Name:
Carbonic anhydrase 2
Synonyms:
CA-II CAC Carbonate dehydratase II Carbonic anhydrase 2 (CA-II) Carbonic anhydrase C Carbonic anhydrase II (CA-II) Carbonic anhydrase II (hCA II) | Carbonic anhydrase isoenzyme II (hCA II)
Type:
Enzyme
Mol. Mass.:
29250.71
Organism:
Homo sapiens (Human)
Description:
P00918
Residue:
260
  
Inhibitor
Name:
BDBM50144825
Synonyms:
CHEMBL75620 N-(2-bromo-4-sulfamoylphenyl)-2,3,5,6-tetrafluorobenzamide
Type:
Small organic molecule
Emp. Form.:
C13H7BrF4N2O3S
Mol. Mass.:
427.169
SMILES:
NS(=O)(=O)c1ccc(NC(=O)c2c(F)c(F)cc(F)c2F)c(Br)c1
: