Target
Carbonic anhydrase 2
Ligand
BDBM50144828
Substrate
Meas. Tech.
ChEBML_45083
Ki
0.700000±n/a nM
Citation
 Vullo, DScozzafava, APastorekova, SPastorek, JSupuran, CT Carbonic anhydrase inhibitors: inhibition of the tumor-associated isozyme IX with fluorine-containing sulfonamides. The first subnanomolar CA IX inhibitor discovered. Bioorg Med Chem Lett 14:2351-6 (2004)  
Target
Name:
Carbonic anhydrase 2
Synonyms:
CA-II CAC Carbonate dehydratase II Carbonic anhydrase 2 (CA-II) Carbonic anhydrase C Carbonic anhydrase II (CA-II) Carbonic anhydrase II (hCA II) | Carbonic anhydrase isoenzyme II (hCA II)
Type:
Enzyme
Mol. Mass.:
29250.71
Organism:
Homo sapiens (Human)
Description:
P00918
Residue:
260
  
Inhibitor
Name:
BDBM50144828
Synonyms:
5-(2,3,5,6-Tetrafluoro-benzenesulfonylamino)-[1,3,4]thiadiazole-2-sulfonic acid amide | CHEMBL307939
Type:
Small organic molecule
Emp. Form.:
C8H4F4N4O4S3
Mol. Mass.:
392.33
SMILES:
NS(=O)(=O)c1nnc(NS(=O)(=O)c2c(F)c(F)cc(F)c2F)s1
: