Target
Delta-type opioid receptor
Ligand
BDBM50146023
Substrate
Meas. Tech.
ChEBML_147053
Ki
2900±n/a nM
Citation
 Jinsmaa, YMiyazaki, AFujita, YLi, TFujisawa, YShiotani, KTsuda, YYokoi, TAmbo, ASasaki, YBryant, SDLazarus, LHOkada, Y Oral bioavailability of a new class of micro-opioid receptor agonists containing 3,6-bis[Dmt-NH(CH(2))(n)]-2(1H)-pyrazinone with central-mediated analgesia. J Med Chem 47:2599-610 (2004)  
Target
Name:
Delta-type opioid receptor
Synonyms:
Cytochrome P450 3A4 Delta opioid receptor Delta-type opioid receptor (DOR) OPRD_RAT Opioid receptor Opioid receptors; mu & delta Ror-a | Voltage-gated potassium channel
Type:
G Protein-Coupled Receptor (GPCR)
Mol. Mass.:
40465.04
Organism:
Rattus norvegicus (rat)
Description:
Competition binding assays were using CHO-K1 cell membranes expressing the opioid receptor.
Residue:
372
  
Inhibitor
Name:
BDBM50146023
Synonyms:
2-Amino-N-[2-(5-{2-[2-amino-3-(4-hydroxy-phenyl)-propionylamino]-ethyl}-3-methyl-6-oxo-1,6-dihydro-pyrazin-2-yl)-ethyl]-3-(4-hydroxy-phenyl)-propionamide; dihydrochloride | CHEMBL3215992
Type:
Small organic molecule
Emp. Form.:
C27H36Cl2N6O5
Mol. Mass.:
595.518
SMILES:
Cl.Cl.Cc1nc(CCNC(=O)C(N)Cc2ccc(O)cc2)c(=O)[nH]c1CCNC(=O)C(N)Cc1ccc(O)cc1
: