Target
S-adenosylmethionine decarboxylase proenzyme
Ligand
BDBM50366973
Substrate
Meas. Tech.
ChEBML_197193
Ki
180000±n/a nM
Citation
 Pankaskie, MAbdel-Monem, MM Inhibitors of polyamine biosynthesis. 8. Irreversible inhibition of mammalian S-adenosyl-L-methionine decarboxylase by substrate analogues. J Med Chem 23:121-7 (1980)  
Target
Name:
S-adenosylmethionine decarboxylase proenzyme
Synonyms:
Amd1 S-adenosylmethionine decarboxylase 1
Type:
PROTEIN
Mol. Mass.:
38134.93
Organism:
Rattus norvegicus
Description:
ChEMBL_197052
Residue:
333
  
Inhibitor
Name:
BDBM50366973
Synonyms:
CHEMBL3392182 | CHEMBL539876
Type:
Small organic molecule
Emp. Form.:
C16H25IN6O5S
Mol. Mass.:
540.376
SMILES:
[I-].C[S+](CCC(C)(N)C(O)=O)C[C@H]1O[C@H]([C@H](O)[C@@H]1O)n1cnc2c(N)ncnc12
: