Target
Cytidine deaminase
Ligand
BDBM50421666
Substrate
Meas. Tech.
ChEMBL_52528 (CHEMBL665300)
Ki
220±n/a nM
Citation
 Marquez, VELiu, PSKelley, JADriscoll, JSMcCormack, JJ Synthesis of 1,3-diazepin-2-one nucleosides as transition-state inhibitors of cytidine deaminase. J Med Chem 23:713-5 (1980)  
Target
Name:
Cytidine deaminase
Synonyms:
CDD_MOUSE Cdd | Cytidine aminohydrolase
Type:
PROTEIN
Mol. Mass.:
16129.75
Organism:
Mus musculus
Description:
ChEMBL_52531
Residue:
146
  
Inhibitor
Name:
BDBM50421666
Synonyms:
CHEMBL2311128 | US9040501, 876404
Type:
Small organic molecule
Emp. Form.:
C9H16N2O6
Mol. Mass.:
248.2331
SMILES:
OC[C@H]1O[C@H]([C@H](O)[C@@H]1O)N1CCC(O)NC1=O
: