Target
Mu-type opioid receptor
Ligand
BDBM50019048
Substrate
Meas. Tech.
ChEBML_147111
IC50
360±n/a nM
Citation
 Gacel, GFournié-Zaluski, MCFellion, ERoques, BP Evidence of the preferential involvement of mu receptors in analgesia using enkephalins highly selective for peripheral mu or delta receptors. J Med Chem 24:1119-24 (1982)  
Target
Name:
Mu-type opioid receptor
Synonyms:
M-OR-1 Mu opioid receptor OPIATE Mu OPRM_CAVPO
Type:
Enzyme Catalytic Domain
Mol. Mass.:
11165.58
Organism:
GUINEA PIG
Description:
P97266
Residue:
98
  
Inhibitor
Name:
BDBM50019048
Synonyms:
(2S,3R)-2-{(S)-2-[(S)-2-(2-{(S)-2-[(S)-2-Amino-3-(4-hydroxy-phenyl)-propionylamino]-3-hydroxy-propionylamino}-acetylamino)-3-phenyl-propionylamino]-4-methyl-pentanoylamino}-3-hydroxy-butyric acid 2-[2-(2-{2-[2-Amino-3-(4-hydroxy-phenyl)-propionylamino]-propionylamino}-acetylamino)-3-phenyl-propionylamino]-4-methyl-pentanoic acid 2-{2-[2-(2-{2-[2-Amino-3-(4-hydroxy-phenyl)-propionylamino]-3-hydroxy-propionylamino}-acetylamino)-3-phenyl-propionylamino]-4-methyl-pentanoylamino}-3-hydroxy-butyric acid(Tyr-D-Ser-Gly-Phe-Leu-Thr) | CHEMBL14230
Type:
Small organic molecule
Emp. Form.:
C33H46N6O10
Mol. Mass.:
686.7525
SMILES:
CC(C)C[C@H](NC(=O)[C@H](Cc1ccccc1)NC(=O)CNC(=O)[C@H](CO)NC(=O)[C@@H](N)Cc1ccc(O)cc1)C(=O)N[C@@H]([C@@H](C)O)C(O)=O
: