Target
Alpha-1A adrenergic receptor
Ligand
BDBM23981
Substrate
Meas. Tech.
ChEBML_33548
EC50
>30000±n/a nM
Citation
 DeMarinis, RMBryan, WMShah, DHHieble, JPPendleton, RG Alpha-adrenergic agents. 1. Direct-acting alpha 1 agonists related to methoxamine. J Med Chem 24:1432-7 (1982)  
Target
Name:
Alpha-1A adrenergic receptor
Synonyms:
ADA1A_HUMAN ADRA1C Alpha 1A-adrenoceptor Alpha adrenergic receptor 1a Alpha-adrenergic receptor 1c adrenergic Alpha1 | adrenergic Alpha1C
Type:
Cell-surface receptors
Mol. Mass.:
51511.67
Organism:
Homo sapiens (Human)
Description:
P35348
Residue:
466
  
Inhibitor
Name:
BDBM23981
Synonyms:
(2S)-1,2,3,4-Tetrahydro-naphthalen-2-ylamine CHEMBL30294 | Tetrahydronaphthalen-2-amine, 3a
Type:
Small organic molecule
Emp. Form.:
C10H13N
Mol. Mass.:
147.2169
SMILES:
NC1CCc2ccccc2C1
: