Target
Mu-type opioid receptor
Ligand
BDBM50304493
Substrate
Meas. Tech.
ChEBML_76213
IC50
17±n/a nM
Citation
 Ramakrishnan, KPortoghese, PS Synthesis and biological evaluation of a metazocine-containing enkephalinamide. Evidence for nonidentical roles of the tyramine moiety in opiates and opioid peptides. J Med Chem 25:1423-7 (1983)  
Target
Name:
Mu-type opioid receptor
Synonyms:
M-OR-1 Mu opioid receptor OPIATE Mu OPRM_CAVPO
Type:
Enzyme Catalytic Domain
Mol. Mass.:
11165.58
Organism:
GUINEA PIG
Description:
P97266
Residue:
98
  
Inhibitor
Name:
BDBM50304493
Synonyms:
CHEMBL595972 Tyr-DAla-Gly-Phe-Met-NH2
Type:
Small organic molecule
Emp. Form.:
C28H38N6O6S
Mol. Mass.:
586.703
SMILES:
CSCC[C@H](NC(=O)[C@H](Cc1ccccc1)NC(=O)CNC(=O)[C@@H](C)NC(=O)[C@@H](N)Cc1ccc(O)cc1)C(N)=O
: