Target
Delta-type opioid receptor
Ligand
BDBM50027512
Substrate
Meas. Tech.
ChEMBL_145901 (CHEMBL750390)
IC50
25±n/a nM
Citation
 DiMaio, JNguyen, TMLemieux, CSchiller, PW Synthesis and pharmacological characterization in vitro of cyclic enkephalin analogues: effect of conformational constraints on opiate receptor selectivity. J Med Chem 25:1432-8 (1983)  
Target
Name:
Delta-type opioid receptor
Synonyms:
DOR-1 MSL-2 OPRD_MOUSE Oprd1
Type:
Enzyme Catalytic Domain
Mol. Mass.:
40577.25
Organism:
MOUSE
Description:
P32300
Residue:
372
  
Inhibitor
Name:
BDBM50027512
Synonyms:
Acetate1-[1-({[1-(1-carbamoyl-3-methyl-butylcarbamoyl)-2-phenyl-ethylcarbamoyl]-methyl}-carbamoyl)-pentylcarbamoyl]-2-(4-hydroxy-phenyl)-ethyl-ammonium; | CHEMBL2372210
Type:
Small organic molecule
Emp. Form.:
C34H50N6O8
Mol. Mass.:
670.7962
SMILES:
CC(O)=O.CCCC[C@@H](NC(=O)[C@@H](N)Cc1ccc(O)cc1)C(=O)NCC(=O)N[C@@H](Cc1ccccc1)C(=O)N[C@@H](CC(C)C)C(N)=O
: